Target
Substance-K receptor
Ligand
BDBM50030213
Substrate
Meas. Tech.
ChEMBL_143189 (CHEMBL749851)
EC50
>50000±n/a nM
Citation
 Grdadolnik, SGMierke, DFByk, GZeltser, IGilon, CKessler, H Comparison of the conformation of active and nonactive backbone cyclic analogs of substance P as a tool to elucidate features of the bioactive conformation: NMR and molecular dynamics in DMSO and water. J Med Chem 37:2145-52 (1994)  
Target
Name:
Substance-K receptor
Synonyms:
NK-2 receptor NK2R NKNAR Neurokinin A receptor Neurokinin-2 (NK-2) SKR TACR2 Tachykinin receptor 2 (NK2) | hnk-3
Type:
Protein
Mol. Mass.:
44455.78
Organism:
Homo sapiens (Human)
Description:
P21452
Residue:
398
  
Inhibitor
Name:
BDBM50030213
Synonyms:
(S)-2-{2-[(2R,5S,8R)-5,8-Dibenzyl-2-(3-guanidino-propyl)-3,6,9,15,19-pentaoxo-1,4,7,10,14pentaaza-cyclononadec-10-yl]-acetylamino}-4-methyl-pentanoic acid ((S)-1-carbamoyl-3-methylsulfanyl-propyl)-amide | CHEMBL303222
Type:
Small organic molecule
Emp. Form.:
C45H67N11O8S
Mol. Mass.:
922.147
SMILES:
CSCC[C@H](NC(=O)[C@H](CC(C)C)NC(=O)CN1CCCNC(=O)CCCC(=O)N[C@H](CCCNC(N)=N)C(=O)N[C@@H](Cc2ccccc2)C(=O)N[C@H](Cc2ccccc2)C1=O)C(N)=O
: