Target
Nischarin
Ligand
BDBM50240366
Substrate
Meas. Tech.
ChEMBL_911251 (CHEMBL3056381)
Ki
1.3±n/a nM
Citation
  TBA Med Chem Res 13:170-189 (2004)    Article 
Target
Name:
Nischarin
Synonyms:
Imidazoline I1 Nisch | Nischarin
Type:
Enzyme Catalytic Domain
Mol. Mass.:
166460.59
Organism:
RAT
Description:
Q4G017
Residue:
1502
  
Inhibitor
Name:
BDBM50240366
Synonyms:
2-(naphthalen-2-yl)-4,5-dihydro-1H-imidazole CHEMBL266155
Type:
Small organic molecule
Emp. Form.:
C13H12N2
Mol. Mass.:
196.2478
SMILES:
C1CN=C(N1)c1ccc2ccccc2c1
: