Target
Nischarin
Ligand
BDBM50000214
Substrate
Meas. Tech.
ChEMBL_911251 (CHEMBL3056381)
Ki
0.933254±n/a nM
Citation
  TBA Med Chem Res 13:170-189 (2004)    Article 
Target
Name:
Nischarin
Synonyms:
Imidazoline I1 Nisch | Nischarin
Type:
Enzyme Catalytic Domain
Mol. Mass.:
166460.59
Organism:
RAT
Description:
Q4G017
Residue:
1502
  
Inhibitor
Name:
BDBM50000214
Synonyms:
CHEMBL337862
Type:
Small organic molecule
Emp. Form.:
C16H17N3
Mol. Mass.:
251.3263
SMILES:
C(Nc1ccccc1-c1ccccc1)C1=NCCN1
: