Target
Nischarin
Ligand
BDBM50417353
Substrate
Meas. Tech.
ChEMBL_911251 (CHEMBL3056381)
Ki
4.0±n/a nM
Citation
  TBA Med Chem Res 13:170-189 (2004)    Article 
Target
Name:
Nischarin
Synonyms:
Imidazoline I1 Nisch | Nischarin
Type:
Enzyme Catalytic Domain
Mol. Mass.:
166460.59
Organism:
RAT
Description:
Q4G017
Residue:
1502
  
Inhibitor
Name:
BDBM50417353
Synonyms:
CHEMBL242265
Type:
Small organic molecule
Emp. Form.:
C17H18N2O
Mol. Mass.:
266.3376
SMILES:
C[C@@H](Oc1ccccc1-c1ccccc1)C1=NCCN1
: