Target
Nischarin
Ligand
BDBM50421578
Substrate
Meas. Tech.
ChEMBL_911251 (CHEMBL3056381)
Ki
2.3±n/a nM
Citation
  TBA Med Chem Res 13:170-189 (2004)    Article 
Target
Name:
Nischarin
Synonyms:
Imidazoline I1 Nisch | Nischarin
Type:
Enzyme Catalytic Domain
Mol. Mass.:
166460.59
Organism:
RAT
Description:
Q4G017
Residue:
1502
  
Inhibitor
Name:
BDBM50421578
Synonyms:
CHEMBL13789
Type:
Small organic molecule
Emp. Form.:
C16H16N2O
Mol. Mass.:
252.311
SMILES:
C(Oc1ccccc1-c1ccccc1)C1=NCCN1
: