Target
Beta-3 adrenergic receptor
Ligand
BDBM50156260
Substrate
Meas. Tech.
ChEMBL_909573 (CHEMBL3059443)
EC50
0.210000±n/a nM
Citation
 Senthil Kumar, PBharatam, PV Comparative 3D QSAR study on ?(1)-, ?(2)-, and ?(3)-adrenoceptor agonists. Med Chem Res 19:1121-1140 (2010)  
Target
Name:
Beta-3 adrenergic receptor
Synonyms:
ADRB3 ADRB3_HUMAN Beta-2 adrenergic receptor and beta-3 adrenergic receptor Beta-3 adrenoreceptor | adrenergic Beta3
Type:
G Protein-Coupled Receptor (GPCR)
Mol. Mass.:
43534.88
Organism:
Homo sapiens (Human)
Description:
Residue:
408
  
Inhibitor
Name:
BDBM50156260
Synonyms:
CHEMBL184407 | Methanesulfonic acid 3-(2-{(R)-(R)-2-hydroxy-2-[3-(thiophene-2-sulfonylamino)-phenyl]-ethylamino}-propyl)-1H-indol-7-yl ester
Type:
Small organic molecule
Emp. Form.:
C24H27N3O6S3
Mol. Mass.:
549.683
SMILES:
C[C@H](Cc1c[nH]c2c(OS(C)(=O)=O)cccc12)NC[C@H](O)c1cccc(NS(=O)(=O)c2cccs2)c1
: