Target
4-diphosphocytidyl-2-C-methyl-D-erythritol kinase, chloroplastic/chromoplastic
Ligand
BDBM50488596
Substrate
Meas. Tech.
ChEMBL_925781 (CHEMBL3069074)
IC50
54000±n/a nM
Citation
 Witschel, MRöhl, FNiggeweg, RNewton, T In search of new herbicidal inhibitors of the non-mevalonate pathway. Pest Manag Sci 69:559-63 (2013)  
Target
Name:
4-diphosphocytidyl-2-C-methyl-D-erythritol kinase, chloroplastic/chromoplastic
Synonyms:
2.7.1.148 CMK ISPE_SOLLC | Ripening-associated protein pTOM41
Type:
PROTEIN
Mol. Mass.:
44528.57
Organism:
Solanum lycopersicum
Description:
ChEMBL_105554
Residue:
401
  
Inhibitor
Name:
BDBM50488596
Synonyms:
CHEMBL2289490
Type:
Small organic molecule
Emp. Form.:
C20H16N4O
Mol. Mass.:
328.3672
SMILES:
NC1=N\C(=N/NC(=O)Cc2cccc3ccccc23)c2ccccc12
: