Target
Muscarinic receptor M1
Ligand
BDBM50034874
Substrate
Meas. Tech.
ChEMBL_138130 (CHEMBL872660)
Ki
0.34±n/a nM
Citation
 Kiesewetter, DOSilverton, JVEckelman, WC Syntheses and biological properties of chiral fluoroalkyl quinuclidinyl benzilates. J Med Chem 38:1711-9 (1995)  
Target
Name:
Muscarinic receptor M1
Synonyms:
Muscarinic acetylcholine receptor M1
Type:
PROTEIN
Mol. Mass.:
15022.43
Organism:
Bos taurus
Description:
ChEMBL_140161
Residue:
139
  
Inhibitor
Name:
BDBM50034874
Synonyms:
(R)-Hydroxy-(4-iodo-phenyl)-phenyl-acetic acid 1-aza-bicyclo[2.2.2]oct-3-yl ester | CHEMBL298085
Type:
Small organic molecule
Emp. Form.:
C21H22INO3
Mol. Mass.:
463.3088
SMILES:
O[C@](C(=O)OC1CN2CCC1CC2)(c1ccccc1)c1ccc(I)cc1
: