Target
Muscarinic receptor M1
Ligand
BDBM50034875
Substrate
Meas. Tech.
ChEMBL_138130 (CHEMBL872660)
Ki
0.26±n/a nM
Citation
 Kiesewetter, DOSilverton, JVEckelman, WC Syntheses and biological properties of chiral fluoroalkyl quinuclidinyl benzilates. J Med Chem 38:1711-9 (1995)  
Target
Name:
Muscarinic receptor M1
Synonyms:
Muscarinic acetylcholine receptor M1
Type:
PROTEIN
Mol. Mass.:
15022.43
Organism:
Bos taurus
Description:
ChEMBL_140161
Residue:
139
  
Inhibitor
Name:
BDBM50034875
Synonyms:
(S)-[4-(2-Fluoro-ethyl)-phenyl]-hydroxy-phenyl-acetic acid 1-aza-bicyclo[2.2.2]oct-3-yl ester | CHEMBL296633
Type:
Small organic molecule
Emp. Form.:
C23H26FNO3
Mol. Mass.:
383.4558
SMILES:
O[C@@](C(=O)OC1CN2CCC1CC2)(c1ccccc1)c1ccc(CCF)cc1
: