Target
C-C chemokine receptor type 4
Ligand
BDBM50380881
Substrate
Meas. Tech.
ChEMBL_941354 (CHEMBL2330056)
IC50
5.5±n/a nM
Citation
 Procopiou, PABarrett, JWBarton, NPBegg, MClapham, DCopley, RCFord, AJGraves, RHHall, DAHancock, APHill, APHobbs, HHodgson, STJumeaux, CLacroix, YMMiah, AHMorriss, KMNeedham, DSheriff, EBSlack, RJSmith, CESollis, SLStaton, H Synthesis and structure-activity relationships of indazole arylsulfonamides as allosteric CC-chemokine receptor 4 (CCR4) antagonists. J Med Chem 56:1946-60 (2013)  
Target
Name:
C-C chemokine receptor type 4
Synonyms:
C-C CKR-4 C-C chemokine receptor type 4 (CCR4) CCR-4 CCR4_HUMAN CMKBR4 | K5-5
Type:
Enzyme
Mol. Mass.:
41406.41
Organism:
Homo sapiens (Human)
Description:
P51679
Residue:
360
  
Inhibitor
Name:
BDBM50380881
Synonyms:
CHEMBL2018953
Type:
Small organic molecule
Emp. Form.:
C24H27Cl2N7O
Mol. Mass.:
500.423
SMILES:
Clc1ccc(CNc2nc(nc3ncccc23)N2CCN(CC2)C(=O)[C@H]2CCCCN2)c(Cl)c1
: