Target
Endolysin
Ligand
BDBM50008558
Substrate
Meas. Tech.
ChEMBL_941014 (CHEMBL2330740)
Kd
156000±n/a nM
Citation
 Merski, MShoichet, BK The impact of introducing a histidine into an apolar cavity site on docking and ligand recognition. J Med Chem 56:2874-84 (2013)  
Target
Name:
Endolysin
Synonyms:
3.2.1.17 ENLYS_BPT4 Lysis protein Muramidase
Type:
PROTEIN
Mol. Mass.:
18699.91
Organism:
Enterobacteria phage T4
Description:
ChEMBL_100178
Residue:
164
  
Inhibitor
Name:
BDBM50008558
Synonyms:
CHEMBL9113 Toluol toluene
Type:
Small organic molecule
Emp. Form.:
C7H8
Mol. Mass.:
92.1384
SMILES:
Cc1ccccc1
: