Target
Endolysin
Ligand
BDBM50490554
Substrate
Meas. Tech.
ChEMBL_941016 (CHEMBL2330742)
Kd
72000±n/a nM
Citation
 Merski, MShoichet, BK The impact of introducing a histidine into an apolar cavity site on docking and ligand recognition. J Med Chem 56:2874-84 (2013)  
Target
Name:
Endolysin
Synonyms:
3.2.1.17 ENLYS_BPT4 Lysis protein Muramidase
Type:
PROTEIN
Mol. Mass.:
18699.91
Organism:
Enterobacteria phage T4
Description:
ChEMBL_100178
Residue:
164
  
Inhibitor
Name:
BDBM50490554
Synonyms:
2-Allylphenol | CHEBI:39826
Type:
Small organic molecule
Emp. Form.:
C9H10O
Mol. Mass.:
134.1751
SMILES:
Oc1ccccc1CC=C
: