Target
Muscarinic receptor M1
Ligand
BDBM50407330
Substrate
Meas. Tech.
ChEMBL_140162 (CHEMBL745467)
Ki
7.4±n/a nM
Citation
 Kiesewetter, DOLee, JLang, LPark, SGPaik, CHEckelman, WC Preparation of 18F-labeled muscarinic agonist with M2 selectivity. J Med Chem 38:5-8 (1995)  
Target
Name:
Muscarinic receptor M1
Synonyms:
Muscarinic acetylcholine receptor M1
Type:
PROTEIN
Mol. Mass.:
15022.43
Organism:
Bos taurus
Description:
ChEMBL_140161
Residue:
139
  
Inhibitor
Name:
BDBM50407330
Synonyms:
CHEMBL2112939
Type:
Small organic molecule
Emp. Form.:
C11H16FN3S2
Mol. Mass.:
273.393
SMILES:
CN1CCC=C(C1)c1nsnc1SCCCF
: