Target
Beta-hexosaminidase subunit alpha/beta
Ligand
BDBM50491605
Substrate
Meas. Tech.
ChEMBL_960954 (CHEMBL2388714)
Ki
4390±n/a nM
Citation
 Guo, PChen, QLiu, TXu, LYang, QQian, X Development of Unsymmetrical Dyads As Potent Noncarbohydrate-Based Inhibitors against Human ?-N-Acetyl-d-hexosaminidase. ACS Med Chem Lett 4:527-31 (2013)  
Target
Name:
Beta-hexosaminidase subunit alpha/beta
Synonyms:
Beta-N-acetyl-D-hexosaminidase-A/B
Type:
Mol. Mass.:
Description:
ASSAY_ID of ChEMBL is 1496351
Components:
This complex has 2 components.
Component 1
Name:
Beta-hexosaminidase subunit alpha
Synonyms:
Beta-N-acetylhexosaminidase subunit alpha HEXA | HEXA_HUMAN
Type:
Protein
Mol. Mass.:
60688.46
Organism:
Homo sapiens (Human)
Description:
P06865
Residue:
529
  
Component 2
Name:
Beta-hexosaminidase subunit beta
Synonyms:
Beta-N-acetylhexosaminidase subunit beta Beta-hexosaminidase subunit beta (Hex B) HEXB_HUMAN | Hexosaminidase subunit B
Type:
Enzyme
Mol. Mass.:
63112.58
Organism:
Homo sapiens (Human)
Description:
P07686
Residue:
556
  
Inhibitor
Name:
BDBM50491605
Synonyms:
CHEMBL2385937
Type:
Small organic molecule
Emp. Form.:
C24H24N2O4
Mol. Mass.:
404.4584
SMILES:
COc1cccc(OCCCNCCN2C(=O)c3cccc4cccc(C2=O)c34)c1
: