Target
Beta-hexosaminidase subunit alpha
Ligand
BDBM50491601
Substrate
Meas. Tech.
ChEMBL_960951 (CHEMBL2388711)
IC50
6000±n/a nM
Citation
 Guo, PChen, QLiu, TXu, LYang, QQian, X Development of Unsymmetrical Dyads As Potent Noncarbohydrate-Based Inhibitors against Human ?-N-Acetyl-d-hexosaminidase. ACS Med Chem Lett 4:527-31 (2013)  
Target
Name:
Beta-hexosaminidase subunit alpha
Synonyms:
Beta-N-acetylhexosaminidase subunit alpha HEXA | HEXA_HUMAN
Type:
Protein
Mol. Mass.:
60688.46
Organism:
Homo sapiens (Human)
Description:
P06865
Residue:
529
  
Inhibitor
Name:
BDBM50491601
Synonyms:
CHEMBL2333316
Type:
Small organic molecule
Emp. Form.:
C28H21N3O4
Mol. Mass.:
463.484
SMILES:
O=C1N(CCNCCN2C(=O)c3cccc4cccc(C2=O)c34)C(=O)c2cccc3cccc1c23
: