Target
D(2) dopamine receptor
Ligand
BDBM50036920
Substrate
Meas. Tech.
ChEMBL_61573 (CHEMBL673374)
IC50
10.0±n/a nM
Citation
 Norman, MHRigdon, GCNavas, FCooper, BR Cyclic benzamides as mixed dopamine D2/serotonin 5-HT2 receptor antagonists: potential atypical antipsychotic agents. J Med Chem 37:2552-63 (1994)  
Target
Name:
D(2) dopamine receptor
Synonyms:
DOPAMINE D2 DOPAMINE D2 Short Dopamine D2 receptor Drd2
Type:
G Protein-Coupled Receptor (GPCR)
Mol. Mass.:
50931.60
Organism:
Rattus norvegicus (rat)
Description:
P61169
Residue:
444
  
Inhibitor
Name:
BDBM50036920
Synonyms:
2-[4-(4-Benzo[d]isothiazol-3-yl-piperazin-1-yl)-butyl]-4a,5,6,7,8,8a-hexahydro-2H-phthalazin-1-one | CHEMBL83625
Type:
Small organic molecule
Emp. Form.:
C23H31N5OS
Mol. Mass.:
425.59
SMILES:
O=C1C2CCCCC2C=NN1CCCCN1CCN(CC1)c1nsc2ccccc12
: