Target
Adenosine receptor A2a
Ligand
BDBM50011301
Substrate
Meas. Tech.
ChEMBL_967980 (CHEMBL2401084)
Ki
12±n/a nM
Citation
 Piersanti, GBartoccini, FLucarini, SCabri, WStasi, MARiccioni, TBorsini, FTarzia, GMinetti, P Synthesis and biological evaluation of metabolites of 2-n-butyl-9-methyl-8-[1,2,3]triazol-2-yl-9H-purin-6-ylamine (ST1535), a potent antagonist of the A2A adenosine receptor for the treatment of Parkinson's disease. J Med Chem 56:5456-63 (2013)  
Target
Name:
Adenosine receptor A2a
Synonyms:
A2A adenosine receptor (hA2A) ADENOSINE A2 ADORA2 Adenosine A2A receptor (A2AAR)
Type:
G Protein-Coupled Receptor (GPCR)
Mol. Mass.:
44716.46
Organism:
Homo sapiens (Human)
Description:
P29274
Residue:
412
  
Inhibitor
Name:
BDBM50011301
Synonyms:
CHEMBL2398486 | US9133197, 7
Type:
Small organic molecule
Emp. Form.:
C12H14N8O
Mol. Mass.:
286.2926
SMILES:
CC(=O)CCc1nc(N)c2nc(-n3nccn3)n(C)c2n1
: