Target
Adenosine receptor A1
Ligand
BDBM181012
Substrate
Meas. Tech.
ChEMBL_967978 (CHEMBL2401082)
Ki
34±n/a nM
Citation
 Piersanti, GBartoccini, FLucarini, SCabri, WStasi, MARiccioni, TBorsini, FTarzia, GMinetti, P Synthesis and biological evaluation of metabolites of 2-n-butyl-9-methyl-8-[1,2,3]triazol-2-yl-9H-purin-6-ylamine (ST1535), a potent antagonist of the A2A adenosine receptor for the treatment of Parkinson's disease. J Med Chem 56:5456-63 (2013)  
Target
Name:
Adenosine receptor A1
Synonyms:
A1 adenosine receptor (hA1) AA1R_HUMAN ADORA1 Adenosine A1-receptor Adenosine receptor A1 (hA1) | Adenosine transporter (AdT)
Type:
G Protein-Coupled Receptor (GPCR)
Mol. Mass.:
36520.92
Organism:
Homo sapiens (Human)
Description:
P30542
Residue:
326
  
Inhibitor
Name:
BDBM181012
Synonyms:
US9133197, 4
Type:
Small organic molecule
Emp. Form.:
C12H16N8O
Mol. Mass.:
288.3084
SMILES:
C[C@@H](O)CCc1nc(N)c2nc(-n3nccn3)n(C)c2n1
: