Target
Carbonic anhydrase 1
Ligand
BDBM50492481
Substrate
Meas. Tech.
ChEMBL_975782 (CHEMBL2415310)
Ki
8.7±n/a nM
Citation
 Akdemir, AGüzel-Akdemir, OScozzafava, ACapasso, CSupuran, CT Inhibition of tumor-associated human carbonic anhydrase isozymes IX and XII by a new class of substituted-phenylacetamido aromatic sulfonamides. Bioorg Med Chem 21:5228-32 (2013)  
Target
Name:
Carbonic anhydrase 1
Synonyms:
CA-I CAB Carbonate dehydratase I Carbonic anhydrase 1 (CA I) Carbonic anhydrase 1 (Recombinant CA I) Carbonic anhydrase B Carbonic anhydrase I (CA I) Carbonic anhydrase I (CAI) Carbonic anhydrase isoenzyme I (hCA I) | hCA
Type:
Enzyme
Mol. Mass.:
28873.37
Organism:
Homo sapiens (Human)
Description:
P00915
Residue:
261
  
Inhibitor
Name:
BDBM50492481
Synonyms:
CHEMBL2402754
Type:
Small organic molecule
Emp. Form.:
C15H15BrN2O4S
Mol. Mass.:
399.26
SMILES:
COc1ccc(CC(=O)Nc2ccc(cc2Br)S(N)(=O)=O)cc1
: