Target
Kappa-type opioid receptor
Ligand
BDBM50066344
Substrate
Meas. Tech.
ChEMBL_980541 (CHEMBL2422700)
Ki
10±n/a nM
Citation
 Yuan, YElbegdorj, OBeletskaya, IOSelley, DEZhang, Y Structure activity relationship studies of 17-cyclopropylmethyl-3,14?-dihydroxy-4,5?-epoxy-6?-(isoquinoline-3'-carboxamido)morphinan (NAQ) analogues as potent opioid receptor ligands: preliminary results on the role of electronic characteristics for affinity and function. Bioorg Med Chem Lett 23:5045-8 (2013)  
Target
Name:
Kappa-type opioid receptor
Synonyms:
KOR-1 OPIATE Kappa Oprk1
Type:
Enzyme
Mol. Mass.:
42656.78
Organism:
Mus musculus (Mouse)
Description:
P33534
Residue:
380
  
Inhibitor
Name:
BDBM50066344
Synonyms:
CHEMBL2419116
Type:
Small organic molecule
Emp. Form.:
C31H30N4O4
Mol. Mass.:
522.5943
SMILES:
[H][C@@]12Oc3c4c(C[C@@]5([H])N(CC6CC6)CC[C@@]14[C@@]5(O)CC[C@@H]2NC(=O)c1cc2ccccc2c(n1)C#N)ccc3O
: