Target
5-hydroxytryptamine receptor 1A
Ligand
BDBM50027060
Substrate
Meas. Tech.
ChEMBL_986492 (CHEMBL2434417)
Ki
35±n/a nM
Citation
 Del Bello, FDiamanti, EGiannella, MMammoli, VMattioli, LTitomanlio, FPiergentili, AQuaglia, WLanza, MSabatini, CCaselli, GPoggesi, EPigini, M Exploring multitarget interactions to reduce opiate withdrawal syndrome and psychiatric comorbidity. ACS Med Chem Lett 4:875-9 (2013)  
Target
Name:
5-hydroxytryptamine receptor 1A
Synonyms:
5-HT-1A 5-hydroxytryptamine receptor 1A (5-HT-1A) ADRB2RL1 Dopamine D2 receptor and serotonin 1a receptor HTR1A | Serotonin receptor 1A
Type:
Mol. Mass.:
46122.49
Organism:
Homo sapiens (Human)
Description:
Residue:
422
  
Inhibitor
Name:
BDBM50027060
Synonyms:
2-(2-Cyclopropyl-phenoxymethyl)-4,5-dihydro-1H-imidazole CHEMBL13852 | CIRAZOLINE
Type:
Small organic molecule
Emp. Form.:
C13H16N2O
Mol. Mass.:
216.2789
SMILES:
C(Oc1ccccc1C1CC1)C1=NCCN1
: