Target
Retinoic acid receptor RXR-beta
Ligand
BDBM50040023
Substrate
Meas. Tech.
ChEMBL_196631 (CHEMBL798185)
Kd
902±n/a nM
Citation
 Boehm, MFZhang, LBadea, BAWhite, SKMais, DEBerger, ESuto, CMGoldman, MEHeyman, RA Synthesis and structure-activity relationships of novel retinoid X receptor-selective retinoids. J Med Chem 37:2930-41 (1994)  
Target
Name:
Retinoic acid receptor RXR-beta
Synonyms:
Nr2b2 Retinoid X receptor beta | Rxrb
Type:
PROTEIN
Mol. Mass.:
55877.78
Organism:
Mus musculus
Description:
ChEMBL_196588
Residue:
520
  
Inhibitor
Name:
BDBM50040023
Synonyms:
4-(3-Fluoro-5,5,8,8-tetramethyl-5,6,7,8-tetrahydro-naphthalene-2-carbonyl)-benzoic acid | CHEMBL419166
Type:
Small organic molecule
Emp. Form.:
C22H23FO3
Mol. Mass.:
354.4146
SMILES:
CC1(C)CCC(C)(C)c2cc(C(=O)c3ccc(cc3)C(O)=O)c(F)cc12
: