Target
Retinoic acid receptor beta
Ligand
BDBM50040010
Substrate
Meas. Tech.
ChEMBL_196659 (CHEMBL799694)
Kd
>1000±n/a nM
Citation
 Boehm, MFZhang, LBadea, BAWhite, SKMais, DEBerger, ESuto, CMGoldman, MEHeyman, RA Synthesis and structure-activity relationships of novel retinoid X receptor-selective retinoids. J Med Chem 37:2930-41 (1994)  
Target
Name:
Retinoic acid receptor beta
Synonyms:
HAP NR1B2 RAR-beta RARB Retinoic acid receptor RXR-alpha/Retinoic acid receptor beta Retinoid receptor
Type:
PROTEIN
Mol. Mass.:
50498.70
Organism:
Homo sapiens (Human)
Description:
ChEMBL_1458015
Residue:
455
  
Inhibitor
Name:
BDBM50040010
Synonyms:
4-(3-Ethyl-5,5,8,8-tetramethyl-5,6,7,8-tetrahydro-naphthalene-2-carbonyl)-benzoic acid | CHEMBL97910
Type:
Small organic molecule
Emp. Form.:
C24H28O3
Mol. Mass.:
364.4773
SMILES:
CCc1cc2c(cc1C(=O)c1ccc(cc1)C(O)=O)C(C)(C)CCC2(C)C
: