Target
Acetylcholinesterase
Ligand
BDBM50089616
Substrate
Meas. Tech.
ChEMBL_1279630 (CHEMBL3097894)
Ki
1.7±n/a nM
Citation
 Cheung, JGary, ENShiomi, KRosenberry, TL Structures of human acetylcholinesterase bound to dihydrotanshinone I and territrem B show peripheral site flexibility. ACS Med Chem Lett 4:1091-6 (2013)  
Target
Name:
Acetylcholinesterase
Synonyms:
ACES_HUMAN Acetylcholinesterase (AChE) | Acetylcholinesterase (human AChE)
Type:
Enzyme
Mol. Mass.:
67792.70
Organism:
Homo sapiens (Human)
Description:
P22303
Residue:
614
  
Inhibitor
Name:
BDBM50089616
Synonyms:
4a,12a-Dihydroxy-4,4,6a,12b-tetramethyl-9-(3,4,5-trimethoxy-phenyl)-4a,6,6a,12,12a,12b-hexahydro-4H,5H-7,10-dioxa-benzo[a]anthracene-1,11-dione territrem B
Type:
Small organic molecule
Emp. Form.:
C29H34O9
Mol. Mass.:
526.5749
SMILES:
COc1cc(cc(OC)c1OC)-c1cc2O[C@]3(C)CC[C@@]4(O)C(C)(C)C=CC(=O)[C@]4(C)[C@@]3(O)Cc2c(=O)o1
: