Target
Protein kinase C delta type
Ligand
BDBM50495188
Substrate
Meas. Tech.
ChEMBL_1284659 (CHEMBL3107240)
EC50
8.0±n/a nM
Citation
 Grue-Sørensen, GLiang, XMånsson, KVedsø, PDahl Sørensen, MSoor, AStahlhut, MBertelsen, MEngell, KMHögberg, T Synthesis, biological evaluation and SAR of 3-benzoates of ingenol for treatment of actinic keratosis and non-melanoma skin cancer. Bioorg Med Chem Lett 24:54-60 (2014)  
Target
Name:
Protein kinase C delta type
Synonyms:
KPCD_HUMAN PKCD Protein Kinase C- delta nPKC-delta
Type:
Enzyme
Mol. Mass.:
77516.79
Organism:
Homo sapiens (Human)
Description:
The recombinant human PKC enzymes were produced using a baculovirus expression system in SF9 cells
Residue:
676
  
Inhibitor
Name:
BDBM50495188
Synonyms:
CHEMBL3105106
Type:
Small organic molecule
Emp. Form.:
C28H35NO6
Mol. Mass.:
481.5806
SMILES:
[H][C@@]12C[C@@H](C)[C@]34C=C(C)[C@H](OC(=O)c5c(C)cccc5N)[C@@]3(O)[C@H](O)C(CO)=C[C@]([H])(C4=O)[C@]1([H])C2(C)C
: