Target
Protein kinase C delta type
Ligand
BDBM50470108
Substrate
Meas. Tech.
ChEMBL_1284659 (CHEMBL3107240)
EC50
4.1±n/a nM
Citation
 Grue-Sørensen, GLiang, XMånsson, KVedsø, PDahl Sørensen, MSoor, AStahlhut, MBertelsen, MEngell, KMHögberg, T Synthesis, biological evaluation and SAR of 3-benzoates of ingenol for treatment of actinic keratosis and non-melanoma skin cancer. Bioorg Med Chem Lett 24:54-60 (2014)  
Target
Name:
Protein kinase C delta type
Synonyms:
KPCD_HUMAN PKCD Protein Kinase C- delta nPKC-delta
Type:
Enzyme
Mol. Mass.:
77516.79
Organism:
Homo sapiens (Human)
Description:
The recombinant human PKC enzymes were produced using a baculovirus expression system in SF9 cells
Residue:
676
  
Inhibitor
Name:
BDBM50470108
Synonyms:
AGN 204332 PEP-005 Picato
Type:
Small organic molecule
Emp. Form.:
C25H34O6
Mol. Mass.:
430.5339
SMILES:
[H][C@@]12C[C@@]([H])(C)[C@]34C=C(C)[C@]([H])(OC(=O)C(\C)=C/C)[C@@]3(O)[C@]([H])(O)C(CO)=C[C@]([H])(C4=O)[C@]1([H])C2(C)C
: