Target
Dihydrofolate reductase
Ligand
BDBM50029766
Substrate
Meas. Tech.
ChEBML_55129
IC50
7.6±n/a nM
Citation
 Gangjee, AShi, JQueener, SFBarrows, LRKisliuk, RL Synthesis of 5-methyl-5-deaza nonclassical antifolates as inhibitors of dihydrofolate reductases and as potential antipneumocystis, antitoxoplasma, and antitumor agents. J Med Chem 36:3437-43 (1993)  
Target
Name:
Dihydrofolate reductase
Synonyms:
DYR_RAT Dihydrofolate reductase (DHFR) Tetrahydrofolate dehydrogenase
Type:
Enzyme
Mol. Mass.:
21638.84
Organism:
Rattus norvegicus (rat)
Description:
Residue:
187
  
Inhibitor
Name:
BDBM50029766
Synonyms:
2,4-DIAMINO-5-METHYL-6-[(3,4,5-TRIMETHOXY-N-METHYLANILINO)METHYL]PYRIDO[2,3-D]PYRIMIDINE CHEMBL50514
Type:
Small organic molecule
Emp. Form.:
C19H24N6O3
Mol. Mass.:
384.4323
SMILES:
COc1cc(cc(OC)c1OC)N(C)Cc1cnc2nc(N)nc(N)c2c1C
: