Target
Dual specificity mitogen-activated protein kinase kinase 2
Ligand
BDBM50498020
Substrate
Meas. Tech.
ChEMBL_1455795 (CHEMBL3361507)
IC50
>100000±n/a nM
Citation
 Redwan, INDyrager, CSolano, CFernández de Trocóniz, GVoisin, LBliman, DMeloche, SGrøtli, M Towards the development of chromone-based MEK1/2 modulators. Eur J Med Chem 85:127-38 (2014)  
Target
Name:
Dual specificity mitogen-activated protein kinase kinase 2
Synonyms:
2.7.12.2 ERK activator kinase 2 MAPK/ERK kinase 2 MEK 2 Map2k2 Mkk2 | Prkmk2
Type:
PROTEIN
Mol. Mass.:
44284.85
Organism:
Rattus norvegicus
Description:
ChEMBL_109633
Residue:
400
  
Inhibitor
Name:
BDBM50498020
Synonyms:
CHEMBL3326320
Type:
Small organic molecule
Emp. Form.:
C16H12ClNO3
Mol. Mass.:
301.724
SMILES:
COc1cccc(c1N)-c1cc(=O)c2cc(Cl)ccc2o1
: