Target
Protease
Ligand
BDBM50498324
Substrate
Meas. Tech.
ChEMBL_1498205 (CHEMBL3583529)
Ki
0.014000±n/a nM
Citation
 Ghosh, AKYu, XOsswald, HLAgniswamy, JWang, YFAmano, MWeber, ITMitsuya, H Structure-based design of potent HIV-1 protease inhibitors with modified P1-biphenyl ligands: synthesis, biological evaluation, and enzyme-inhibitor X-ray structural studies. J Med Chem 58:5334-43 (2015)  
Target
Name:
Protease
Synonyms:
Type:
Enzyme
Mol. Mass.:
10904.79
Organism:
Human immunodeficiency virus 1 (HIV-1)
Description:
Q9YQ12
Residue:
99
  
Inhibitor
Name:
BDBM50498324
Synonyms:
CHEMBL3581666
Type:
Small organic molecule
Emp. Form.:
C36H46N2O10S
Mol. Mass.:
698.823
SMILES:
[H][C@@]12CCO[C@]1([H])OC[C@@H]2OC(=O)N[C@@H](Cc1cccc(c1)-c1cc(OC)cc(OC)c1)[C@H](O)CN(CC(C)C)S(=O)(=O)c1ccc(OC)cc1
: