Target
Lysine-specific demethylase 4E
Ligand
BDBM60875
Substrate
Meas. Tech.
ChEMBL_1519856 (CHEMBL3624699)
IC50
19953±n/a nM
Citation
 England, KSTumber, AKrojer, TScozzafava, GNg, SSDaniel, MSzykowska, AChe, Kvon Delft, FBurgess-Brown, NAKawamura, ASchofield, CJBrennan, PE Optimisation of a triazolopyridine based histone demethylase inhibitor yields a potent and selective KDM2A (FBXL11) inhibitor. Medchemcomm 5:1879-1886 (2014)  
Target
Name:
Lysine-specific demethylase 4E
Synonyms:
2-OG-Dependent Histone Demethylase JMJD2E Jumonji domain-containing protein 2E (JMJD2E) KDM4DL KDM4E_HUMAN Lysine-specific demethylase 4E | Lysine-specific demethylase 4E (KDM4E)
Type:
Enzyme
Mol. Mass.:
56815.71
Organism:
Homo sapiens (Human)
Description:
B2RXH2
Residue:
506
  
Inhibitor
Name:
BDBM60875
Synonyms:
3-((6-(4,5-Dihydro-1H-benzo[d]azepin-3(2H)-yl)-2-(pyridin-2-yl)pyrimidin-4-yl)amino)propanoic acid GSK J1 GSKJ1
Type:
Emp. Form.:
C22H23N5O2
Mol. Mass.:
389.4503
SMILES:
OC(=O)CCNc1cc(nc(n1)-c1ccccn1)N1CCc2ccccc2CC1
: