Target
Lysine-specific demethylase 3A
Ligand
BDBM60875
Substrate
Meas. Tech.
ChEMBL_1519867 (CHEMBL3624710)
IC50
39811±n/a nM
Citation
 England, KSTumber, AKrojer, TScozzafava, GNg, SSDaniel, MSzykowska, AChe, Kvon Delft, FBurgess-Brown, NAKawamura, ASchofield, CJBrennan, PE Optimisation of a triazolopyridine based histone demethylase inhibitor yields a potent and selective KDM2A (FBXL11) inhibitor. Medchemcomm 5:1879-1886 (2014)  
Target
Name:
Lysine-specific demethylase 3A
Synonyms:
JHDM2A JMJD1A Jumonji domain-containing protein 1A KDM3A_HUMAN Lysine-specific demethylase 3A (KDM3A) | TSGA
Type:
PROTEIN
Mol. Mass.:
147368.22
Organism:
Homo sapiens (Human)
Description:
Q9Y4C1
Residue:
1321
  
Inhibitor
Name:
BDBM60875
Synonyms:
3-((6-(4,5-Dihydro-1H-benzo[d]azepin-3(2H)-yl)-2-(pyridin-2-yl)pyrimidin-4-yl)amino)propanoic acid GSK J1 GSKJ1
Type:
Emp. Form.:
C22H23N5O2
Mol. Mass.:
389.4503
SMILES:
OC(=O)CCNc1cc(nc(n1)-c1ccccn1)N1CCc2ccccc2CC1
: