Target
Platelet-activating factor receptor
Ligand
BDBM50001747
Substrate
Meas. Tech.
ChEMBL_221702 (CHEMBL823402)
IC50
3300±n/a nM
Citation
 Trova, MPWissner, ACarroll, MLKerwar, SSPickett, WCSchaub, RETorley, LWKohler, CA Analogues of platelet activating factor. 8. Antagonists of PAF containing an aromatic ring linked to a pyridinium ring. J Med Chem 36:580-90 (1993)  
Target
Name:
Platelet-activating factor receptor
Synonyms:
PAF-R PTAFR_CAVPO Platelet-activating factor receptor
Type:
Protein
Mol. Mass.:
39005.63
Organism:
Cavia porcellus
Description:
Residue:
342
  
Inhibitor
Name:
BDBM50001747
Synonyms:
(+)-Kadsurenone 5-Allyl-2-(3,4-dimethoxy-phenyl)-3a-methoxy-3-methyl-3,3a-dihydro-2H-benzofuran-6-one KADSURENONE
Type:
Small organic molecule
Emp. Form.:
C21H24O5
Mol. Mass.:
356.4123
SMILES:
COc1ccc(cc1OC)[C@H]1OC2=CC(=O)C(CC=C)=C[C@]2(OC)[C@@H]1C
: