Target
Glutamate receptor ionotropic, NMDA 2B
Ligand
BDBM50499215
Substrate
Meas. Tech.
ChEMBL_1538265 (CHEMBL3737377)
Ki
1.6±n/a nM
Citation
 Gawaskar, SSchepmann, DBonifazi, ARobaa, DSippl, WWünsch, B Benzo[7]annulene-based GluN2B selective NMDA receptor antagonists: Surprising effect of a nitro group in 2-position. Bioorg Med Chem Lett 25:5748-51 (2015)  
Target
Name:
Glutamate receptor ionotropic, NMDA 2B
Synonyms:
GRIN2B Glutamate [NMDA] receptor subunit epsilon 2 N-methyl D-aspartate receptor subtype 2B NMDAR2B NR3 | hNR3
Type:
PROTEIN
Mol. Mass.:
166375.46
Organism:
Homo sapiens (Human)
Description:
ChEMBL_1438829
Residue:
1484
  
Inhibitor
Name:
BDBM50499215
Synonyms:
CHEMBL3735947
Type:
Small organic molecule
Emp. Form.:
C20H24N2O2
Mol. Mass.:
324.4168
SMILES:
[O-][N+](=O)c1ccc2CCC(CCc2c1)NCCCc1ccccc1
: