Target
Retinoic acid receptor beta
Ligand
BDBM50048296
Substrate
Meas. Tech.
ChEMBL_195496 (CHEMBL798917)
Ki
3±n/a nM
Citation
 Charpentier, BBernardon, JMEustache, JMillois, CMartin, BMichel, SShroot, B Synthesis, structure-affinity relationships, and biological activities of ligands binding to retinoic acid receptor subtypes. J Med Chem 38:4993-5006 (1996)  
Target
Name:
Retinoic acid receptor beta
Synonyms:
HAP NR1B2 RAR-beta RARB Retinoic acid receptor RXR-alpha/Retinoic acid receptor beta Retinoid receptor
Type:
PROTEIN
Mol. Mass.:
50498.70
Organism:
Homo sapiens (Human)
Description:
ChEMBL_1458015
Residue:
455
  
Inhibitor
Name:
BDBM50048296
Synonyms:
4-(5,5,8,8-Tetramethyl-5,6,7,8-tetrahydro-anthracen-2-yl)-benzoic acid | CHEMBL36768
Type:
Small organic molecule
Emp. Form.:
C25H26O2
Mol. Mass.:
358.4727
SMILES:
CC1(C)CCC(C)(C)c2cc3cc(ccc3cc12)-c1ccc(cc1)C(O)=O
: