Target
Polyunsaturated fatty acid 5-lipoxygenase
Ligand
BDBM50048991
Substrate
Meas. Tech.
ChEMBL_3905 (CHEMBL619910)
IC50
320±n/a nM
Citation
 Hamer, RRTegeler, JJKurtz, ESAllen, RCBailey, SCElliott, MEHellyer, LHelsley, GCPrzekop, PFreed, BSWhite, JMartin, LL Dibenzoxepinone hydroxylamines and hydroxamic acids: dual inhibitors of cyclooxygenase and 5-lipoxygenase with potent topical antiinflammatory activity. J Med Chem 39:246-52 (1996)  
Target
Name:
Polyunsaturated fatty acid 5-lipoxygenase
Synonyms:
Alox5 LOX5_RAT
Type:
PROTEIN
Mol. Mass.:
78082.31
Organism:
Rattus norvegicus
Description:
ChEMBL_1432947
Residue:
673
  
Inhibitor
Name:
BDBM50048991
Synonyms:
CHEMBL84599 | N-[2-(6,11-Dihydro-dibenzo[b,e]oxepin-2-yl)-ethyl]-N-ethyl-hydroxylamine
Type:
Small organic molecule
Emp. Form.:
C18H21NO2
Mol. Mass.:
283.3648
SMILES:
CCN(O)CCc1ccc2OCc3ccccc3Cc2c1
: