Target
Polyunsaturated fatty acid 5-lipoxygenase
Ligand
BDBM50049007
Substrate
Meas. Tech.
ChEMBL_3905 (CHEMBL619910)
IC50
620±n/a nM
Citation
 Hamer, RRTegeler, JJKurtz, ESAllen, RCBailey, SCElliott, MEHellyer, LHelsley, GCPrzekop, PFreed, BSWhite, JMartin, LL Dibenzoxepinone hydroxylamines and hydroxamic acids: dual inhibitors of cyclooxygenase and 5-lipoxygenase with potent topical antiinflammatory activity. J Med Chem 39:246-52 (1996)  
Target
Name:
Polyunsaturated fatty acid 5-lipoxygenase
Synonyms:
Alox5 LOX5_RAT
Type:
PROTEIN
Mol. Mass.:
78082.31
Organism:
Rattus norvegicus
Description:
ChEMBL_1432947
Residue:
673
  
Inhibitor
Name:
BDBM50049007
Synonyms:
2-[3-(Hydroxy-methyl-amino)-propyl]-6H-dibenzo[b,e]oxepin-11-one | CHEMBL84670
Type:
Small organic molecule
Emp. Form.:
C18H19NO3
Mol. Mass.:
297.3484
SMILES:
CN(O)CCCc1ccc2OCc3ccccc3C(=O)c2c1
: