Target
Polyunsaturated fatty acid 5-lipoxygenase
Ligand
BDBM50407748
Substrate
Meas. Tech.
ChEMBL_3905 (CHEMBL619910)
IC50
1190±n/a nM
Citation
 Hamer, RRTegeler, JJKurtz, ESAllen, RCBailey, SCElliott, MEHellyer, LHelsley, GCPrzekop, PFreed, BSWhite, JMartin, LL Dibenzoxepinone hydroxylamines and hydroxamic acids: dual inhibitors of cyclooxygenase and 5-lipoxygenase with potent topical antiinflammatory activity. J Med Chem 39:246-52 (1996)  
Target
Name:
Polyunsaturated fatty acid 5-lipoxygenase
Synonyms:
Alox5 LOX5_RAT
Type:
PROTEIN
Mol. Mass.:
78082.31
Organism:
Rattus norvegicus
Description:
ChEMBL_1432947
Residue:
673
  
Inhibitor
Name:
BDBM50407748
Synonyms:
CHEMBL2114190
Type:
Small organic molecule
Emp. Form.:
C17H15NO4
Mol. Mass.:
297.3053
SMILES:
CN(O)C(=O)Cc1ccc2OCc3ccccc3C(=O)c2c1
: