Target
Neuromedin-U receptor 2
Ligand
BDBM50500784
Substrate
Meas. Tech.
ChEMBL_1550249 (CHEMBL3760532)
EC50
1.9±n/a nM
Citation
 Micewicz, EDBahattab, OSWillars, GBWaring, AJNavab, MWhitelegge, JPMcBride, WHRuchala, P Small lipidated anti-obesity compounds derived from neuromedin U. Eur J Med Chem 101:616-26 (2015)  
Target
Name:
Neuromedin-U receptor 2
Synonyms:
G-protein coupled receptor FM-4 NMU-R2 NMU2R NMUR2_HUMAN TGR1
Type:
PROTEIN
Mol. Mass.:
47710.86
Organism:
Homo sapiens (Human)
Description:
ChEMBL_103075
Residue:
415
  
Inhibitor
Name:
BDBM50500784
Synonyms:
CHEMBL4299242
Type:
Small organic molecule
Emp. Form.:
C92H159N17O23
Mol. Mass.:
1871.347
SMILES:
CCCCCCCCCCCCCCCC(=O)NCCOCCOCCOCCOCCOCCOCCOCCOCCOCCOCCOCCOCCC(=O)NC(C)(C)C(=O)N[C@H](Cc1ccccc1)C(=O)N[C@@H](CC(C)C)C(=O)N[C@@H](Cc1ccccc1)C(=O)N[C@@H](CCCNC(N)=N)C(=O)N1CCC[C@H]1C(=O)N[C@@H](CCCNC(N)=N)C(=O)N[C@@H](CC(N)=O)C(N)=O
: