Target
Amine oxidase [flavin-containing] B
Ligand
BDBM19187
Substrate
Meas. Tech.
ChEMBL_1575831 (CHEMBL3801874)
IC50
48±n/a nM
Citation
 Chirkova, ZVKabanova, MVFilimonov, SIAbramov, IGPetzer, APetzer, JPSuponitsky, KY An evaluation of synthetic indole derivatives as inhibitors of monoamine oxidase. Bioorg Med Chem Lett 26:2214-9 (2016)  
Target
Name:
Amine oxidase [flavin-containing] B
Synonyms:
AOFB_HUMAN MAOB Monoamine oxidase type B (MAO B) Monoamine oxidase type B (MAOB)
Type:
Protein
Mol. Mass.:
58768.76
Organism:
Homo sapiens (Human)
Description:
P27338
Residue:
520
  
Inhibitor
Name:
BDBM19187
Synonyms:
(2S)-2-[({4-[(3-fluorophenyl)methoxy]phenyl}methyl)amino]propanamide SAG US9051240, (S)-(+)-2-[4-(3-Fluorobenzyloxy)-benzylamino]-propanamide
Type:
Small organic molecule
Emp. Form.:
C17H19FN2O2
Mol. Mass.:
302.3434
SMILES:
[H][C@@](C)(NCc1ccc(OCc2cccc(F)c2)cc1)C(N)=O
: