Target
GTPase KRas
Ligand
BDBM50501346
Substrate
Meas. Tech.
ChEMBL_1628560 (CHEMBL3871145)
Ki
50000±n/a nM
Citation
 Xiong, YLu, JHunter, JLi, LScott, DChoi, HGLim, SMManandhar, AGondi, SSim, TWestover, KDGray, NS Covalent Guanosine Mimetic Inhibitors of G12C KRAS. ACS Med Chem Lett 8:61-66 (2017)  
Target
Name:
GTPase KRas
Synonyms:
GTPase KRas, N-terminally processed KRAS Ki-Ras RASK_HUMAN c-Ki-ras
Type:
PROTEIN
Mol. Mass.:
21656.10
Organism:
Homo sapiens (Human)
Description:
ChEMBL_1476955
Residue:
189
  
Inhibitor
Name:
BDBM50501346
Synonyms:
CHEMBL3945018
Type:
Small organic molecule
Emp. Form.:
C18H27ClN6O11P2
Mol. Mass.:
600.841
SMILES:
Nc1nc2n(cnc2c(=O)[nH]1)[C@@H]1O[C@H](COP(O)(=O)CP(O)(=O)O[C@@H]2CC[C@@H](C2)NC(=O)CCl)[C@@H](O)[C@H]1O
: