Target
Tyrosine-protein kinase BTK
Ligand
BDBM209866
Substrate
Meas. Tech.
ChEMBL_1656295 (CHEMBL4005765)
Ki
62300±n/a nM
Citation
 Thorarensen, ADowty, MEBanker, MEJuba, BJussif, JLin, TVincent, FCzerwinski, RMCasimiro-Garcia, AUnwalla, RTrujillo, JILiang, SBalbo, PChe, YGilbert, AMBrown, MFHayward, MMontgomery, JLeung, LYang, XSoucy, SHegen, MCoe, JLangille, JVajdos, FChrencik, JTelliez, JB Design of a Janus Kinase 3 (JAK3) Specific Inhibitor 1-((2S,5R)-5-((7H-Pyrrolo[2,3-d]pyrimidin-4-yl)amino)-2-methylpiperidin-1-yl)prop-2-en-1-one (PF-06651600) Allowing for the Interrogation of JAK3 Signaling in Humans. J Med Chem 60:1971-1993 (2017)  
Target
Name:
Tyrosine-protein kinase BTK
Synonyms:
AGMX1 Agammaglobulinaemia tyrosine kinase B cell progenitor kinase BPK BTK_HUMAN Tyrosine Kinase BTK Tyrosine-protein kinase BTK (BTK)
Type:
Enzyme
Mol. Mass.:
76289.95
Organism:
Homo sapiens (Human)
Description:
Q06187
Residue:
659
  
Inhibitor
Name:
BDBM209866
Synonyms:
PF-06651600 US20230348487, Example PF-06651600 | US9617258, Example 5
Type:
Small organic molecule
Emp. Form.:
C15H19N5O
Mol. Mass.:
285.3443
SMILES:
C[C@H]1CC[C@H](CN1C(=O)C=C)Nc1ncnc2[nH]ccc12
: