Target
Retinoic acid receptor gamma
Ligand
BDBM50052414
Substrate
Meas. Tech.
ChEMBL_196321 (CHEMBL806264)
Kd
3824±n/a nM
Citation
 Teng, MDuong, TTKlein, ESPino, MEChandraratna, RA Identification of a retinoic acid receptor alpha subtype specific agonist. J Med Chem 39:3035-8 (1996)  
Target
Name:
Retinoic acid receptor gamma
Synonyms:
NR1B3 RAR-gamma RARG_HUMAN Retinoic acid receptor gamma | Retinoid receptor
Type:
PROTEIN
Mol. Mass.:
50345.43
Organism:
Homo sapiens (Human)
Description:
ChEMBL_1458016
Residue:
454
  
Inhibitor
Name:
BDBM50052414
Synonyms:
4-(1,1,4,4-tetramethyl-1,2,3,4-tetrahydronaphthalene-7-carboxamido)benzoic acid 4-[(5,5,8,8-Tetramethyl-5,6,7,8-tetrahydro-naphthalene-2-carbonyl)-amino]-benzoic acid CHEMBL69367 | US9963439, AM580
Type:
Small organic molecule
Emp. Form.:
C22H25NO3
Mol. Mass.:
351.4388
SMILES:
CC1(C)CCC(C)(C)c2cc(ccc12)C(=O)Nc1ccc(cc1)C(O)=O
: