Target
Vasopressin V1a receptor
Ligand
BDBM35714
Substrate
Meas. Tech.
ChEMBL_214553 (CHEMBL820170)
IC50
1400±n/a nM
Citation
 Ogawa, HYamashita, HKondo, KYamamura, YMiyamoto, HKan, KKitano, KTanaka, MNakaya, KNakamura, SMori, TTominaga, MYabuuchi, Y Orally active, nonpeptide vasopressin V2 receptor antagonists: a novel series of 1-[4-(benzoylamino)benzoyl]-2,3,4,5-tetrahydro-1H-benzazepines and related compounds. J Med Chem 39:3547-55 (1996)  
Target
Name:
Vasopressin V1a receptor
Synonyms:
Avpr1a VASOPRESSIN V1A Vasopressin V1a receptor | Vasopressin receptor
Type:
Enzyme Catalytic Domain
Mol. Mass.:
47674.81
Organism:
RAT
Description:
VASOPRESSIN V1A AVPR1A RAT::P30560
Residue:
424
  
Inhibitor
Name:
BDBM35714
Synonyms:
CHEMBL420762 N-[4-(5-Dimethylamino-2,3,4,5-tetrahydro-benzo[b]azepine-1-carbonyl)-phenyl]-2-methyl-benzamide | OPC-31260
Type:
Small organic molecule
Emp. Form.:
C27H29N3O2
Mol. Mass.:
427.5381
SMILES:
CN(C)C1CCCN(C(=O)c2ccc(NC(=O)c3ccccc3C)cc2)c2ccccc12
: