Target
Acidic mammalian chitinase
Ligand
BDBM50504029
Substrate
Meas. Tech.
ChEMBL_1813251 (CHEMBL4312825)
IC50
110±n/a nM
Citation
 Mazur, MDymek, BKoralewski, RSklepkiewicz, POlejniczak, SMazurkiewicz, MPiotrowicz, MSalamon, MJ?drzejczak, KZagozdzon, ACzestkowski, WMatyszewski, KBorek, BBartoszewicz, APluta, ERymaszewska, AMozga, WStefaniak, FDobrza?ski, PDzwonek, KGolab, JGolebiowski, AOlczak, J Development of Dual Chitinase Inhibitors as Potential New Treatment for Respiratory System Diseases. J Med Chem 62:7126-7145 (2019)  
Target
Name:
Acidic mammalian chitinase
Synonyms:
AMCase Chia YNL
Type:
PROTEIN
Mol. Mass.:
51991.60
Organism:
Mus musculus
Description:
ChEMBL_828636
Residue:
473
  
Inhibitor
Name:
BDBM50504029
Synonyms:
CHEMBL4442416
Type:
Small organic molecule
Emp. Form.:
C19H29ClN6O
Mol. Mass.:
392.926
SMILES:
CO[C@H](C)CN(CCc1ccc(Cl)cc1)C1CCN(CC1)c1nc(N)n[nH]1
: