Target
Retinoic acid receptor gamma
Ligand
BDBM50055113
Substrate
Meas. Tech.
ChEMBL_196328 (CHEMBL806271)
Kd
1490±n/a nM
Citation
 Johnson, ATKlein, ESWang, LPino, MEChandraratna, RA Identification of retinoic acid receptor beta subtype specific agonists. J Med Chem 39:5027-30 (1997)  
Target
Name:
Retinoic acid receptor gamma
Synonyms:
NR1B3 RAR-gamma RARG_HUMAN Retinoic acid receptor gamma | Retinoid receptor
Type:
PROTEIN
Mol. Mass.:
50345.43
Organism:
Homo sapiens (Human)
Description:
ChEMBL_1458016
Residue:
454
  
Inhibitor
Name:
BDBM50055113
Synonyms:
5,5-Dimethyl-8-thiophen-2-yl-5,6-dihydro-naphthalene-2-carboxylic acid 4-carboxy-phenyl ester | CHEMBL148327
Type:
Small organic molecule
Emp. Form.:
C24H20O4S
Mol. Mass.:
404.478
SMILES:
CC1(C)CC=C(c2cccs2)c2cc(ccc12)C(=O)Oc1ccc(cc1)C(O)=O
: