Target
Serine/threonine-protein kinase pim-3
Ligand
BDBM50505052
Substrate
Meas. Tech.
ChEMBL_1817341 (CHEMBL4317001)
Ki
0.009000±n/a nM
Citation
 Wang, XBlackaby, WAllen, VChan, GKYChang, JHChiang, PCDične, CDrummond, JDo, SFan, EHarstad, EBHodges, AHu, HJia, WKofie, WKolesnikov, ALyssikatos, JPLy, JMatteucci, MMoffat, JGMunugalavadla, VMurray, JNash, DNoland, CLDel Rosario, GRoss, LRouse, CSharpe, ASlaga, DSun, MTsui, VWallweber, HYu, SFEbens, AJ Optimization of Pan-Pim Kinase Activity and Oral Bioavailability Leading to Diaminopyrazole (GDC-0339) for the Treatment of Multiple Myeloma. J Med Chem 62:2140-2153 (2019)  
Target
Name:
Serine/threonine-protein kinase pim-3
Synonyms:
PIM3 Serine/threonine-protein kinase pim-3 (PIM3)
Type:
Protein
Mol. Mass.:
35888.19
Organism:
Homo sapiens (Human)
Description:
Q86V86
Residue:
326
  
Inhibitor
Name:
BDBM50505052
Synonyms:
CHEMBL3623150
Type:
Small organic molecule
Emp. Form.:
C20H21F4N7OS
Mol. Mass.:
483.486
SMILES:
Cn1ncc(NC(=O)c2nc(sc2N)-c2c(F)cccc2F)c1N1CC[C@@H](N)CC(F)(F)C1
: