Target
Fatty-acid amide hydrolase 1
Ligand
BDBM50505180
Substrate
Meas. Tech.
ChEMBL_1821756 (CHEMBL4321416)
IC50
<10.0±n/a nM
Citation
 Otrubova, KChatterjee, SGhimire, SCravatt, BFBoger, DL N-Acyl pyrazoles: Effective and tunable inhibitors of serine hydrolases. Bioorg Med Chem 27:1693-1703 (2019)  
Target
Name:
Fatty-acid amide hydrolase 1
Synonyms:
Anandamide amidohydrolase FAAH1_MOUSE Faah1 Fatty-acid amide hydrolase (FAAH) Oleamide hydrolase 1
Type:
Hydrolase; single-pass membrane protein; homodimer
Mol. Mass.:
63227.28
Organism:
Mus musculus (mouse)
Description:
Mouse brain membranes were used in the assay.
Residue:
579
  
Inhibitor
Name:
BDBM50505180
Synonyms:
CHEMBL4462665
Type:
Small organic molecule
Emp. Form.:
C24H25N5O2
Mol. Mass.:
415.4876
SMILES:
O=C(N1CCCN(Cc2ccc(OCc3ccccc3)cc2)CC1)n1cc(cn1)C#N
: