Target
Fatty-acid amide hydrolase 1
Ligand
BDBM50052781
Substrate
Meas. Tech.
ChEMBL_1821756 (CHEMBL4321416)
IC50
90±n/a nM
Citation
 Otrubova, KChatterjee, SGhimire, SCravatt, BFBoger, DL N-Acyl pyrazoles: Effective and tunable inhibitors of serine hydrolases. Bioorg Med Chem 27:1693-1703 (2019)  
Target
Name:
Fatty-acid amide hydrolase 1
Synonyms:
Anandamide amidohydrolase FAAH1_MOUSE Faah1 Fatty-acid amide hydrolase (FAAH) Oleamide hydrolase 1
Type:
Hydrolase; single-pass membrane protein; homodimer
Mol. Mass.:
63227.28
Organism:
Mus musculus (mouse)
Description:
Mouse brain membranes were used in the assay.
Residue:
579
  
Inhibitor
Name:
BDBM50052781
Synonyms:
CHEMBL3318603
Type:
Small organic molecule
Emp. Form.:
C19H20N4O
Mol. Mass.:
320.3883
SMILES:
O=C(N1CCN(Cc2ccc3ccccc3c2)CC1)n1cccn1
: