Target
Monoglyceride lipase
Ligand
BDBM50052781
Substrate
Meas. Tech.
ChEMBL_1821757 (CHEMBL4321417)
IC50
960±n/a nM
Citation
 Otrubova, KChatterjee, SGhimire, SCravatt, BFBoger, DL N-Acyl pyrazoles: Effective and tunable inhibitors of serine hydrolases. Bioorg Med Chem 27:1693-1703 (2019)  
Target
Name:
Monoglyceride lipase
Synonyms:
MAG lipase Mgll Monoglyceride Lipase (MGL)
Type:
Hydrolase
Mol. Mass.:
33391.67
Organism:
Mus musculus (mouse)
Description:
Assays were using membranes of recombinant MAG Lipase transiently transfected in COS-7 cells.
Residue:
303
  
Inhibitor
Name:
BDBM50052781
Synonyms:
CHEMBL3318603
Type:
Small organic molecule
Emp. Form.:
C19H20N4O
Mol. Mass.:
320.3883
SMILES:
O=C(N1CCN(Cc2ccc3ccccc3c2)CC1)n1cccn1
: