Target
Neutral cholesterol ester hydrolase 1
Ligand
BDBM50505193
Substrate
Meas. Tech.
ChEMBL_1821759 (CHEMBL4321419)
IC50
>100000±n/a nM
Citation
 Otrubova, KChatterjee, SGhimire, SCravatt, BFBoger, DL N-Acyl pyrazoles: Effective and tunable inhibitors of serine hydrolases. Bioorg Med Chem 27:1693-1703 (2019)  
Target
Name:
Neutral cholesterol ester hydrolase 1
Synonyms:
Aadacl1 CPO-BP Kiaa1363 NCEH1_MOUSE Neutral cholesterol ester hydrolase
Type:
Single-pass type II membrane protein; hydrolase
Mol. Mass.:
45742.11
Organism:
Mus musculus (mouse)
Description:
Assays were using membranes of recombinant KIAA1363 transiently transfected in COS-7 cells.
Residue:
408
  
Inhibitor
Name:
BDBM50505193
Synonyms:
CHEMBL4588296
Type:
Small organic molecule
Emp. Form.:
C29H26N4O
Mol. Mass.:
446.5429
SMILES:
O=C(N1CCN(CC1)C(c1ccc2ccccc2c1)c1ccc2ccccc2c1)n1cccn1
: